Autor Thema: Python 2.6 instalation schlägt fehl.  (Gelesen 176 mal)

0 Mitglieder und 1 Gast betrachten dieses Thema.

Offline PilsBirne

  • Neuling
  • *
  • Beiträge: 1
  • Skill: Anfänger
Python 2.6 instalation schlägt fehl.
« am: 17. August 2019, 13:51:04 »
Hallo, ich brauche für ein Programm Python 2.6 das finde ich auch in den aur quellen nur leider bekomme ich bei der Installation eine Fehlermeldung, mit der ich nix anfangen kann, eventuell könnt ihr mir ja helfen es zu installieren, hier mal die Fehlermeldung.
Finde leider nicht wirklich, was bei google.

test_del_stdout_before_print (test.test_file.StdoutTests) ... ok
test_move_stdout_on_write (test.test_file.StdoutTests) ... ok

======================================================================
FAIL: testStdin (test.test_file.OtherFileTests)
----------------------------------------------------------------------
Traceback (most recent call last):
  File "/var/tmp/pamac-build-pilsbirne/python26/src/Python-2.6.9/Lib/test/test_file.py", line 205, in testStdin
    self.assertRaises(IOError, sys.stdin.seek, -1)
AssertionError: IOError not raised

----------------------------------------------------------------------
Ran 38 tests in 3.960s

FAILED (failures=1)
test test_file failed -- Traceback (most recent call last):
  File "/var/tmp/pamac-build-pilsbirne/python26/src/Python-2.6.9/Lib/test/test_file.py", line 205, in testStdin
    self.assertRaises(IOError, sys.stdin.seek, -1)
AssertionError: IOError not raised

make: *** [Makefile:701: test] Fehler 1
==> FEHLER: Ein Fehler geschah in check().
    Breche ab...